{"text_format":"1","workbook":"xlsx","n_sheets":4,"sheets":["find_ρ","database","stats","GR-DE"],"not_rendered":{"charts":0,"images":0,"macros":1,"external_links":0,"defined_names":5,"comments":0,"pivot_tables":0},"unopened":[],"bounds":{"document_bytes":16777216,"sheet_cells":100000,"rows_first":2000,"rows_last":500,"rows_between":2000,"halvings":0,"cell_chars":16384,"cell_head_chars":4096},"cells_cut":0,"cells_raw":0,"read":"whole","date_system":"1900"}

{"sheet":"find_ρ","index":0,"n_rows":26,"n_cols":6,"rows_kept":26,"cut":false,"hidden":false,"merged":[[2,2,2,4]]}
["Suchbegriff:",{"$f":"IF(LEN(A2)<3,\"\",IF(ISERROR(MATCH(TRIM(A2&\"*\"),x,0)),\"\",MATCH(TRIM(A2&\"*\"),x,0)))","v":3199},"= Zeile in Sammlung","Mit der Schaltfläche  \"Zeilen anpassen\" kann die Zeilenhöhe an den Inhalt angepasst werden."]
["κερδίζω","<-------","Für den Suchbegriff bitte mindestens 3 Zeichen in das Feld Α2 eingeben (für \"ζω \" bitte + einem Leerzeichen)! **)"]
[null,null,"angezeigt wird eine Zeile vor dem Treffer bis 10 Zeilen nach dem Treffer."]
[]
["ενεστώτας ","NN","αόριστος","μετοχή","σημειώσεις","στα Γερμανικά"]
[{"$f":"IF($B$1=\"\",\"\",INDIRECT(\"database!A\"&$B$1+(ROW()-7)))","v":"κερδίζομαι"},{"$f":"IF($B$1=\"\",\"\",INDIRECT(\"database!B\"&$B$1+(ROW()-7)))","v":232},{"$f":"IF($B$1=\"\",\"\",INDIRECT(\"database!C\"&$B$1+(ROW()-7)))","v":"κερδήθηκα"},{"$f":"IF($B$1=\"\",\"\",INDIRECT(\"database!D\"&$B$1+(ROW()-7)))","v":"κερδισμένος"},{"$f":"IF($B$1=\"\",\"\",INDIRECT(\"database!E\"&$B$1+(ROW()-7)))","v":""},{"$f":"IF(ISERROR(VLOOKUP(TRIM(A6),'GR-DE'!A:B,2,FALSE)),\"---\",VLOOKUP(TRIM(A6),'GR-DE'!A:B,2,FALSE))","v":"---"}]
["κερδίζω",33,"κέρδισα","","",{"$f":"IF(ISERROR(VLOOKUP(TRIM(A7),'GR-DE'!A:B,2,FALSE)),\"---\",VLOOKUP(TRIM(A7),'GR-DE'!A:B,2,FALSE))","v":"profitieren, siegen"}]
["κερδοσκοπώ",73,"κερδοσκόπησα","","",{"$f":"IF(ISERROR(VLOOKUP(TRIM(A8),'GR-DE'!A:B,2,FALSE)),\"---\",VLOOKUP(TRIM(A8),'GR-DE'!A:B,2,FALSE))","v":"spekulieren"}]
["κερνάω",68,"κέρασα","","",{"$f":"IF(ISERROR(VLOOKUP(TRIM(A9),'GR-DE'!A:B,2,FALSE)),\"---\",VLOOKUP(TRIM(A9),'GR-DE'!A:B,2,FALSE))","v":"ausschenken, spendieren, einladen zu etwas"}]
["κερνιέμαι",69,"κεράστηκα","κερασμένος","",{"$f":"IF(ISERROR(VLOOKUP(TRIM(A10),'GR-DE'!A:B,2,FALSE)),\"---\",VLOOKUP(TRIM(A10),'GR-DE'!A:B,2,FALSE))","v":"---"}]
["κερνώ",68,"κέρασα","","",{"$f":"IF(ISERROR(VLOOKUP(TRIM(A11),'GR-DE'!A:B,2,FALSE)),\"---\",VLOOKUP(TRIM(A11),'GR-DE'!A:B,2,FALSE))","v":"---"}]
["κερώνω",3,"κέρωσα","κερωμένος","* -> σημειώσεις",{"$f":"IF(ISERROR(VLOOKUP(TRIM(A12),'GR-DE'!A:B,2,FALSE)),\"---\",VLOOKUP(TRIM(A12),'GR-DE'!A:B,2,FALSE))","v":"---"}]
["κεφαλαιοποιούμαι","74, 75","κεφαλαιοποιήθηκα","κεφαλαιοποιημένος","",{"$f":"IF(ISERROR(VLOOKUP(TRIM(A13),'GR-DE'!A:B,2,FALSE)),\"---\",VLOOKUP(TRIM(A13),'GR-DE'!A:B,2,FALSE))","v":"---"}]
["κεφαλαιοποιώ",73,"κεφαλαιοποίησα","","",{"$f":"IF(ISERROR(VLOOKUP(TRIM(A14),'GR-DE'!A:B,2,FALSE)),\"---\",VLOOKUP(TRIM(A14),'GR-DE'!A:B,2,FALSE))","v":"---"}]
["κηδεμονεύομαι",20,"κηδεμονεύτηκα και κηδεμονεύθηκα","","",{"$f":"IF(ISERROR(VLOOKUP(TRIM(A15),'GR-DE'!A:B,2,FALSE)),\"---\",VLOOKUP(TRIM(A15),'GR-DE'!A:B,2,FALSE))","v":"---"}]
["κηδεμονεύω","19, 17","κηδεμόνευσα και κηδεμόνεψα","","",{"$f":"IF(ISERROR(VLOOKUP(TRIM(A16),'GR-DE'!A:B,2,FALSE)),\"---\",VLOOKUP(TRIM(A16),'GR-DE'!A:B,2,FALSE))","v":"---"}]
["κηδεύομαι",18,"κηδεύτηκα","","",{"$f":"IF(ISERROR(VLOOKUP(TRIM(A17),'GR-DE'!A:B,2,FALSE)),\"---\",VLOOKUP(TRIM(A17),'GR-DE'!A:B,2,FALSE))","v":"---"}]
[]
["Datensätze aktuell:",{"$f":"COUNTA(x)-1","v":6786},"Datenstand vom: ","2014-11-21"]
["Übersetzungen:",{"$f":"COUNTA('GR-DE'!A:A)-1","v":1468},"letzte Eingabe: ",{"$f":"INDIRECT(\"database!A\"&B19+1)","v":"ωχριώ"}]
[]
["** Achtung! die richtig gesetzten Betonungszeichen eingeben, sonst funktioniert die Suche nicht!"]
["Zeilenanpassung von Hand: Die Zeilen 6 bis 17 markieren, in der Spalte ganz links mit den Zeilennummern an das Ende von Zeile 17 gehen und wenn"]
["ein horizontaler Balken mit einem Pfeil nach oben und unten erscheint einen Doppelklick machen."]
["Wer sich an der Fehlerbehebung und Ergänzung beteiligen möchte, bitte hier:"]
["http://www.symi.at/ta_elen_dat/ta_rhmata_help.pdf"]

{"sheet":"database","index":1,"n_rows":6787,"n_cols":6,"rows_kept":6787,"cut":false,"hidden":false,"merged":[]}
["ενεστώτας ","NN","αόριστος","μετοχή","σημειώσεις"]
["αβασκαίνω",null,"","","-> δες βασκαίνω"]
["αβγαταίνω",47,"αβγάτυνα","αβγατισμένος","και αβγατίζω, αβγάτισα, αβγατισμένος 33",{"$f":"IF(A2&B2&C2&D2&E2=A3&B3&C3&D3&E3,\"@\",\"\")","v":""}]
["αβγατίζω",33,"αβγάτισα","αβγατισμένος","",""]
["αγαθοφέρνω",226,"","","(μόνο στον ενεστ. και παρατατ.)",""]
["αγαλλιάζω",35,"αγαλλίασα","","",""]
["αγανακτώ",73,"αγανάκτησα","αγανακτισμένος","",""]
["αγαναχτώ",73,"αγανάκτησα","αγανακτισμένος","",""]
["αγαντάρω",53,"αγάνταρα και αγαντάρισα","αγανταρισμένος","",""]
["αγαπάω",58,"αγάπησα","","",""]
["αγαπιέμαι",59,"αγαπήθηκα","αγαπημένος","",""]
["αγαπίζω",33,"αγάπησα","","",""]
["αγαπώ",58,"αγάπησα","","",""]
["αγγαρεύομαι",18,"αγγαρεύτηκα","αγγαρεμένος","",""]
["αγγαρεύω",17,"αγγάρεψα","","",""]
["αγγίζομαι",24,"αγγίχτηκα","αγγιγμένος","",""]
["αγγίζω",23,"άγγιξα","","",""]
["αγιάζομαι",36,"αγιάστηκα","αγιασμένος","* -> σημειώσεις",""]
["αγιάζω",35,"άγιασα και αγίασα","","* -> σημειώσεις",""]
["αγκαζάρω",55,"αγκαζάρισα","αγκαζαρισμένος","",""]
["αγκαλιάζομαι",36,"αγκαλιάστηκα","αγκαλιασμένος","",""]
["αγκαλιάζω",35,"αγκάλιασα","","",""]
["αγκιστρώνομαι",4,"αγκιστρώθηκα","αγκιστρωμένος","",""]
["αγκιστρώνω",3,"αγκίστρωσα","","",""]
["αγκομαχάω",58,"","","(παρατατ. συνήθως -ούσα; κυρίως στον ενεστ. και παρατ.)",""]
["αγκομαχώ",58,"","","(παρατατ. συνήθως -ούσα; κυρίως στον ενεστ. και παρατ.)",""]
["αγκυλώνομαι",4,"αγκυλώθηκα","αγκυλωμένος","",""]
["αγκυλώνω",3,"αγκύλωσα","","",""]
["αγκυροβολάω",58,"αγκυροβόλησα","αγκυροβολημένος","(παρατατ. συνήθως -ούσα)",""]
["αγκυροβολώ",58,"αγκυροβόλησα","αγκυροβολημένος","(παρατατ. συνήθως -ούσα)",""]
["αγκυροβολώ",73,"αγκυροβόλησα","αγκυροβολημένος","",""]
["αγκωνιάζομαι",36,"αγκωνιάστηκα","αγκωνιασμένος","",""]
["αγκωνιάζω",35,"αγκώνιασα","","",""]
["αγναντεύω",17,"αγνάντεψα","","",""]
["αγνοούμαι",74,"αγνοήθηκα","αγνοημένος","",""]
["αγνοώ",73,"αγνόησα","","",""]
["άγομαι",136,"","","* -> σημειώσεις (να αχθώ)",""]
["αγοράζομαι",36,"αγοράστηκα","αγορασμένος","",""]
["αγοράζω",35,"αγόρασα","","",""]
["αγορεύω",19,"αγόρευσα","","",""]
{"$rows_left_out":6748}
{"sheet":"stats","index":2,"n_rows":241,"n_cols":14,"rows_kept":241,"cut":false,"hidden":false,"merged":[]}
["Regel #","Anzahl","Regel #","Anzahl","Regel #","Anzahl","Regel #","Anzahl","Regel #","Anzahl",null,"Häufigste: ","Regel #","Anzahl"]
[1,{"$f":"COUNTIF(database!B:B,stats!A2)","v":32},51,{"$f":"COUNTIF(database!B:B,stats!C2)","v":2},101,{"$f":"COUNTIF(database!B:B,stats!E2)","v":2},150,{"$f":"COUNTIF(database!B:B,stats!G2)","v":2},200,{"$f":"COUNTIF(database!B:B,stats!I2)","v":3},null,null,73,{"$f":"COUNTIF(database!B:B,M2)","v":593}]
[{"$f":"A2+1","v":2},{"$f":"COUNTIF(database!B:B,stats!A3)","v":39},{"$f":"C2+1","v":52},{"$f":"COUNTIF(database!B:B,stats!C3)","v":5},{"$f":"E2+1","v":102},{"$f":"COUNTIF(database!B:B,stats!E3)","v":1},{"$f":"G2+1","v":151},{"$f":"COUNTIF(database!B:B,stats!G3)","v":8},{"$f":"I2+1","v":201},{"$f":"COUNTIF(database!B:B,stats!I3)","v":1},null,null,33,{"$f":"COUNTIF(database!B:B,M3)","v":589}]
[{"$f":"A3+1","v":3},{"$f":"COUNTIF(database!B:B,stats!A4)","v":520},{"$f":"C3+1","v":53},{"$f":"COUNTIF(database!B:B,stats!C4)","v":67},{"$f":"E3+1","v":103},{"$f":"COUNTIF(database!B:B,stats!E4)","v":1},{"$f":"G3+1","v":152},{"$f":"COUNTIF(database!B:B,stats!G4)","v":4},{"$f":"I3+1","v":202},{"$f":"COUNTIF(database!B:B,stats!I4)","v":1},null,null,3,{"$f":"COUNTIF(database!B:B,M4)","v":520}]
[4,{"$f":"COUNTIF(database!B:B,stats!A5)","v":419},54,{"$f":"COUNTIF(database!B:B,stats!C5)","v":46},104,{"$f":"COUNTIF(database!B:B,stats!E5)","v":6},153,{"$f":"COUNTIF(database!B:B,stats!G5)","v":3},203,{"$f":"COUNTIF(database!B:B,stats!I5)","v":1},null,null,34,{"$f":"COUNTIF(database!B:B,M5)","v":439}]
[5,{"$f":"COUNTIF(database!B:B,stats!A6)","v":31},55,{"$f":"COUNTIF(database!B:B,stats!C6)","v":62},105,{"$f":"COUNTIF(database!B:B,stats!E6)","v":3},154,{"$f":"COUNTIF(database!B:B,stats!G6)","v":6},204,{"$f":"COUNTIF(database!B:B,stats!I6)","v":2},null,null,4,{"$f":"COUNTIF(database!B:B,M6)","v":419}]
[6,{"$f":"COUNTIF(database!B:B,stats!A7)","v":26},56,{"$f":"COUNTIF(database!B:B,stats!C7)","v":2},106,{"$f":"COUNTIF(database!B:B,stats!E7)","v":1},155,{"$f":"COUNTIF(database!B:B,stats!G7)","v":1},205,{"$f":"COUNTIF(database!B:B,stats!I7)","v":2},null,null,58,{"$f":"COUNTIF(database!B:B,M7)","v":370}]
[7,{"$f":"COUNTIF(database!B:B,stats!A8)","v":35},57,{"$f":"COUNTIF(database!B:B,stats!C8)","v":2},107,{"$f":"COUNTIF(database!B:B,stats!E8)","v":1},156,{"$f":"COUNTIF(database!B:B,stats!G8)","v":1},206,{"$f":"COUNTIF(database!B:B,stats!I8)","v":4},null,null,35,{"$f":"COUNTIF(database!B:B,M8)","v":341}]
[8,{"$f":"COUNTIF(database!B:B,stats!A9)","v":19},58,{"$f":"COUNTIF(database!B:B,stats!C9)","v":370},108,{"$f":"COUNTIF(database!B:B,stats!E9)","v":3},157,{"$f":"COUNTIF(database!B:B,stats!G9)","v":1},207,{"$f":"COUNTIF(database!B:B,stats!I9)","v":8},null,null,74,{"$f":"COUNTIF(database!B:B,M9)","v":287}]
[9,{"$f":"COUNTIF(database!B:B,stats!A10)","v":30},59,{"$f":"COUNTIF(database!B:B,stats!C10)","v":106},109,{"$f":"COUNTIF(database!B:B,stats!E10)","v":2},158,{"$f":"COUNTIF(database!B:B,stats!G10)","v":12},208,{"$f":"COUNTIF(database!B:B,stats!I10)","v":3},null,null,36,{"$f":"COUNTIF(database!B:B,M10)","v":207}]
[10,{"$f":"COUNTIF(database!B:B,stats!A11)","v":12},60,{"$f":"COUNTIF(database!B:B,stats!C11)","v":46},110,{"$f":"COUNTIF(database!B:B,stats!E11)","v":3},159,{"$f":"COUNTIF(database!B:B,stats!G11)","v":13},209,{"$f":"COUNTIF(database!B:B,stats!I11)","v":2},null,null,17,{"$f":"COUNTIF(database!B:B,M11)","v":133}]
[11,{"$f":"COUNTIF(database!B:B,stats!A12)","v":27},61,{"$f":"COUNTIF(database!B:B,stats!C12)","v":59},111,{"$f":"COUNTIF(database!B:B,stats!E12)","v":1},160,{"$f":"COUNTIF(database!B:B,stats!G12)","v":5},210,{"$f":"COUNTIF(database!B:B,stats!I12)","v":9},null,null,59,{"$f":"COUNTIF(database!B:B,M12)","v":106}]
[12,{"$f":"COUNTIF(database!B:B,stats!A13)","v":23},62,{"$f":"COUNTIF(database!B:B,stats!C13)","v":17},112,{"$f":"COUNTIF(database!B:B,stats!E13)","v":1},161,{"$f":"COUNTIF(database!B:B,stats!G13)","v":3},211,{"$f":"COUNTIF(database!B:B,stats!I13)","v":2},null,null,20,{"$f":"COUNTIF(database!B:B,M13)","v":102}]
[13,{"$f":"COUNTIF(database!B:B,stats!A14)","v":34},63,{"$f":"COUNTIF(database!B:B,stats!C14)","v":6},113,{"$f":"COUNTIF(database!B:B,stats!E14)","v":3},162,{"$f":"COUNTIF(database!B:B,stats!G14)","v":4},212,{"$f":"COUNTIF(database!B:B,stats!I14)","v":2},null,null,19,{"$f":"COUNTIF(database!B:B,M14)","v":95}]
[14,{"$f":"COUNTIF(database!B:B,stats!A15)","v":9},64,{"$f":"COUNTIF(database!B:B,stats!C15)","v":15},114,{"$f":"COUNTIF(database!B:B,stats!E15)","v":1},163,{"$f":"COUNTIF(database!B:B,stats!G15)","v":7},213,{"$f":"COUNTIF(database!B:B,stats!I15)","v":4},null,null,23,{"$f":"COUNTIF(database!B:B,M15)","v":89}]
[15,{"$f":"COUNTIF(database!B:B,stats!A16)","v":4},65,{"$f":"COUNTIF(database!B:B,stats!C16)","v":4},115,{"$f":"COUNTIF(database!B:B,stats!E16)","v":2},164,{"$f":"COUNTIF(database!B:B,stats!G16)","v":5},214,{"$f":"COUNTIF(database!B:B,stats!I16)","v":15},null,null,18,{"$f":"COUNTIF(database!B:B,M16)","v":82}]
[16,{"$f":"COUNTIF(database!B:B,stats!A17)","v":2},66,{"$f":"COUNTIF(database!B:B,stats!C17)","v":27},116,{"$f":"COUNTIF(database!B:B,stats!E17)","v":1},165,{"$f":"COUNTIF(database!B:B,stats!G17)","v":13},215,{"$f":"COUNTIF(database!B:B,stats!I17)","v":1},null,null,"74, 75",{"$f":"COUNTIF(database!B:B,M17)","v":74}]
[17,{"$f":"COUNTIF(database!B:B,stats!A18)","v":133},67,{"$f":"COUNTIF(database!B:B,stats!C18)","v":10},117,{"$f":"COUNTIF(database!B:B,stats!E18)","v":1},166,{"$f":"COUNTIF(database!B:B,stats!G18)","v":15},216,{"$f":"COUNTIF(database!B:B,stats!I18)","v":2},null,null,53,{"$f":"COUNTIF(database!B:B,M18)","v":67}]
[18,{"$f":"COUNTIF(database!B:B,stats!A19)","v":82},68,{"$f":"COUNTIF(database!B:B,stats!C19)","v":45},118,{"$f":"COUNTIF(database!B:B,stats!E19)","v":1},167,{"$f":"COUNTIF(database!B:B,stats!G19)","v":3},217,{"$f":"COUNTIF(database!B:B,stats!I19)","v":28},null,null,44,{"$f":"COUNTIF(database!B:B,M19)","v":64}]
[19,{"$f":"COUNTIF(database!B:B,stats!A20)","v":95},69,{"$f":"COUNTIF(database!B:B,stats!C20)","v":10},119,{"$f":"COUNTIF(database!B:B,stats!E20)","v":4},168,{"$f":"COUNTIF(database!B:B,stats!G20)","v":1},218,{"$f":"COUNTIF(database!B:B,stats!I20)","v":18},null,null,55,{"$f":"COUNTIF(database!B:B,M20)","v":62}]
[20,{"$f":"COUNTIF(database!B:B,stats!A21)","v":102},70,{"$f":"COUNTIF(database!B:B,stats!C21)","v":26},120,{"$f":"COUNTIF(database!B:B,stats!E21)","v":6},169,{"$f":"COUNTIF(database!B:B,stats!G21)","v":2},{"$f":"I20+1","v":219},{"$f":"COUNTIF(database!B:B,stats!I21)","v":4},null,null,61,{"$f":"COUNTIF(database!B:B,M21)","v":59}]
[21,{"$f":"COUNTIF(database!B:B,stats!A22)","v":26},71,{"$f":"COUNTIF(database!B:B,stats!C22)","v":11},121,{"$f":"COUNTIF(database!B:B,stats!E22)","v":3},170,{"$f":"COUNTIF(database!B:B,stats!G22)","v":1},220,{"$f":"COUNTIF(database!B:B,stats!I22)","v":5},null,null,54,{"$f":"COUNTIF(database!B:B,M22)","v":46}]
[22,{"$f":"COUNTIF(database!B:B,stats!A23)","v":23},72,{"$f":"COUNTIF(database!B:B,stats!C23)","v":9},122,{"$f":"COUNTIF(database!B:B,stats!E23)","v":16},171,{"$f":"COUNTIF(database!B:B,stats!G23)","v":4},221,{"$f":"COUNTIF(database!B:B,stats!I23)","v":4},null,null,60,{"$f":"COUNTIF(database!B:B,M23)","v":46}]
[23,{"$f":"COUNTIF(database!B:B,stats!A24)","v":89},73,{"$f":"COUNTIF(database!B:B,stats!C24)","v":593},123,{"$f":"COUNTIF(database!B:B,stats!E24)","v":1},172,{"$f":"COUNTIF(database!B:B,stats!G24)","v":26},222,{"$f":"COUNTIF(database!B:B,stats!I24)","v":2},null,null,68,{"$f":"COUNTIF(database!B:B,M24)","v":45}]
[24,{"$f":"COUNTIF(database!B:B,stats!A25)","v":37},74,{"$f":"COUNTIF(database!B:B,stats!C25)","v":287},124,{"$f":"COUNTIF(database!B:B,stats!E25)","v":4},173,{"$f":"COUNTIF(database!B:B,stats!G25)","v":8},223,{"$f":"COUNTIF(database!B:B,stats!I25)","v":4},null,null,27,{"$f":"COUNTIF(database!B:B,M25)","v":42}]
[25,{"$f":"COUNTIF(database!B:B,stats!A26)","v":11},75,{"$f":"COUNTIF(database!B:B,stats!C26)","v":1},125,{"$f":"COUNTIF(database!B:B,stats!E26)","v":3},174,{"$f":"COUNTIF(database!B:B,stats!G26)","v":3},224,{"$f":"COUNTIF(database!B:B,stats!I26)","v":1},null,null,2,{"$f":"COUNTIF(database!B:B,M26)","v":39}]
[26,{"$f":"COUNTIF(database!B:B,stats!A27)","v":7},76,{"$f":"COUNTIF(database!B:B,stats!C27)","v":31},126,{"$f":"COUNTIF(database!B:B,stats!E27)","v":3},175,{"$f":"COUNTIF(database!B:B,stats!G27)","v":1},225,{"$f":"COUNTIF(database!B:B,stats!I27)","v":7},null,null,24,{"$f":"COUNTIF(database!B:B,M27)","v":37}]
[27,{"$f":"COUNTIF(database!B:B,stats!A28)","v":42},77,{"$f":"COUNTIF(database!B:B,stats!C28)","v":14},127,{"$f":"COUNTIF(database!B:B,stats!E28)","v":1},176,{"$f":"COUNTIF(database!B:B,stats!G28)","v":10},226,{"$f":"COUNTIF(database!B:B,stats!I28)","v":10},null,null,7,{"$f":"COUNTIF(database!B:B,M28)","v":35}]
[28,{"$f":"COUNTIF(database!B:B,stats!A29)","v":35},78,{"$f":"COUNTIF(database!B:B,stats!C29)","v":12},128,{"$f":"COUNTIF(database!B:B,stats!E29)","v":3},177,{"$f":"COUNTIF(database!B:B,stats!G29)","v":8},227,{"$f":"COUNTIF(database!B:B,stats!I29)","v":2},null,null,28,{"$f":"COUNTIF(database!B:B,M29)","v":35}]
[29,{"$f":"COUNTIF(database!B:B,stats!A30)","v":17},79,{"$f":"COUNTIF(database!B:B,stats!C30)","v":10},129,{"$f":"COUNTIF(database!B:B,stats!E30)","v":3},178,{"$f":"COUNTIF(database!B:B,stats!G30)","v":11},228,{"$f":"COUNTIF(database!B:B,stats!I30)","v":6},null,null,13,{"$f":"COUNTIF(database!B:B,M30)","v":34}]
[30,{"$f":"COUNTIF(database!B:B,stats!A31)","v":14},80,{"$f":"COUNTIF(database!B:B,stats!C31)","v":2},130,{"$f":"COUNTIF(database!B:B,stats!E31)","v":3},179,{"$f":"COUNTIF(database!B:B,stats!G31)","v":1},229,{"$f":"COUNTIF(database!B:B,stats!I31)","v":4},null,null,49,{"$f":"COUNTIF(database!B:B,M31)","v":34}]
[31,{"$f":"COUNTIF(database!B:B,stats!A32)","v":16},81,{"$f":"COUNTIF(database!B:B,stats!C32)","v":2},131,{"$f":"COUNTIF(database!B:B,stats!E32)","v":6},180,{"$f":"COUNTIF(database!B:B,stats!G32)","v":9},230,{"$f":"COUNTIF(database!B:B,stats!I32)","v":1},null,null,1,{"$f":"COUNTIF(database!B:B,M32)","v":32}]
[32,{"$f":"COUNTIF(database!B:B,stats!A33)","v":15},82,{"$f":"COUNTIF(database!B:B,stats!C33)","v":5},132,{"$f":"COUNTIF(database!B:B,stats!E33)","v":4},181,{"$f":"COUNTIF(database!B:B,stats!G33)","v":1},231,{"$f":"COUNTIF(database!B:B,stats!I33)","v":3},null,null,5,{"$f":"COUNTIF(database!B:B,M33)","v":31}]
[33,{"$f":"COUNTIF(database!B:B,stats!A34)","v":589},83,{"$f":"COUNTIF(database!B:B,stats!C34)","v":4},133,{"$f":"COUNTIF(database!B:B,stats!E34)","v":7},182,{"$f":"COUNTIF(database!B:B,stats!G34)","v":2},232,{"$f":"COUNTIF(database!B:B,stats!I34)","v":2},null,null,48,{"$f":"COUNTIF(database!B:B,M34)","v":31}]
[34,{"$f":"COUNTIF(database!B:B,stats!A35)","v":439},84,{"$f":"COUNTIF(database!B:B,stats!C35)","v":1},134,{"$f":"COUNTIF(database!B:B,stats!E35)","v":1},183,{"$f":"COUNTIF(database!B:B,stats!G35)","v":1},233,{"$f":"COUNTIF(database!B:B,stats!I35)","v":4},null,null,76,{"$f":"COUNTIF(database!B:B,M35)","v":31}]
[35,{"$f":"COUNTIF(database!B:B,stats!A36)","v":341},85,{"$f":"COUNTIF(database!B:B,stats!C36)","v":15},135,{"$f":"COUNTIF(database!B:B,stats!E36)","v":11},184,{"$f":"COUNTIF(database!B:B,stats!G36)","v":1},234,{"$f":"COUNTIF(database!B:B,stats!I36)","v":2},null,null,9,{"$f":"COUNTIF(database!B:B,M36)","v":30}]
[36,{"$f":"COUNTIF(database!B:B,stats!A37)","v":207},86,{"$f":"COUNTIF(database!B:B,stats!C37)","v":7},136,{"$f":"COUNTIF(database!B:B,stats!E37)","v":12},185,{"$f":"COUNTIF(database!B:B,stats!G37)","v":3},235,{"$f":"COUNTIF(database!B:B,stats!I37)","v":1},null,null,217,{"$f":"COUNTIF(database!B:B,M37)","v":28}]
[37,{"$f":"COUNTIF(database!B:B,stats!A38)","v":10},87,{"$f":"COUNTIF(database!B:B,stats!C38)","v":7},137,{"$f":"COUNTIF(database!B:B,stats!E38)","v":15},186,{"$f":"COUNTIF(database!B:B,stats!G38)","v":14},"17, 19",{"$f":"COUNTIF(database!B:B,stats!I38)","v":16},null,null,11,{"$f":"COUNTIF(database!B:B,M38)","v":27}]
[38,{"$f":"COUNTIF(database!B:B,stats!A39)","v":8},88,{"$f":"COUNTIF(database!B:B,stats!C39)","v":6},138,{"$f":"COUNTIF(database!B:B,stats!E39)","v":19},187,{"$f":"COUNTIF(database!B:B,stats!G39)","v":12},"19, 17",{"$f":"COUNTIF(database!B:B,stats!I39)","v":25},null,null,66,{"$f":"COUNTIF(database!B:B,M39)","v":27}]
[39,{"$f":"COUNTIF(database!B:B,stats!A40)","v":9},89,{"$f":"COUNTIF(database!B:B,stats!C40)","v":2},139,{"$f":"COUNTIF(database!B:B,stats!E40)","v":5},188,{"$f":"COUNTIF(database!B:B,stats!G40)","v":10},"74, 75",{"$f":"COUNTIF(database!B:B,stats!I40)","v":74},null,null,6,{"$f":"COUNTIF(database!B:B,M40)","v":26}]
{"$rows_left_out":202}
{"sheet":"GR-DE","index":3,"n_rows":1469,"n_cols":3,"rows_kept":1469,"cut":false,"hidden":false,"merged":[]}
["αγάλλομαι","frohlocken"]
["αγαπάω","lieben"]
["αγαπιέμαι","geliebt werden"]
["αγαπώ","lieben"]
["αγγέλω","ankündigen, anmelden, ansagen, anzeigen, inserieren"]
["αγγίζω","abtasten, anfassen, berühren, betasten, fühlen"]
["αγιάζω","heiligen"]
["αγκαλιάζομαι","kuscheln"]
["αγκαλιάζω","sich umarmen"]
["αγκιστρεύω","fischen"]
["αγκυλώνω","stechen, sticheln"]
["αγκυροβολώ","ankern"]
["αγνοώ","ignorieren"]
["αγοράζομαι","gekauft werden"]
["αγοράζω","kaufen"]
["άγω","fahren, führen, treiben"]
["αγωνίζομαι","kämpfen"]
["αδειάζω","ausleeren, auspacken, evakuieren"]
["αδρανώ","dahinvegetieren, vegetieren"]
["αδυνατίζω","abmagern, entkräften, ermatten, erschlaffen"]
["άδω","besingen, pfeifen, singen"]
["αερίζω","belüften, durchlüften, entlüften, lüften, ventilieren"]
["αηδιάζω","verabscheuen"]
["αθετώ","annullieren"]
["αθροίζω","addieren, hinzufügen, hinzuzählen, zusammenrechnen, zusammenzählen"]
["αθωώνω","freisprechen"]
["αιμορραγώ","bluten"]
["αίρομαι","entfallen"]
["αίρω","hochheben, aufheben, auf sich nehmen"]
["αισθάνομαι","empfinden, fühlen, verspüren, wahrnehmen"]
["αιτιολογώ","begründen"]
["αιτούμαι","beantragen"]
["αιφνιδιάζω","überraschen, überraschend angreifen"]
["αιωρούμαι","schweben"]
["ακμάζω","geraten, glücken"]
["ακολουθώ","folgen, begleiten, verfolgen"]
["ακονίζω","anspitzen, schärfen, schleifen, spitzen, zuspitzen"]
["ακούγομαι","gehört werden"]
["ακούω","anhören, erfahren, hören, zuhören"]
["ακρωτηριάζω","abnehmen, abschneiden, amputieren"]
{"$rows_left_out":1429}